java - JUnit 运行程序从 java.io.Writer 获取 NullPointerException

标签 java junit surefire


我从 Maven Surefire 插件收到 NullPointerException。它仅发生在使用 DBUnit 的测试中。 Surefire 报告文件为空。

-------------------------------------------------------
 T E S T S
-------------------------------------------------------
org.apache.maven.surefire.booter.SurefireExecutionException: null; nested exception is java.lang.NullPointerException: null
java.lang.NullPointerException
    at java.io.Writer.write(Writer.java:140)
    at java.io.PrintWriter.newLine(PrintWriter.java:436)
    at java.io.PrintWriter.println(PrintWriter.java:585)
    at java.io.PrintWriter.println(PrintWriter.java:696)
    at org.apache.maven.surefire.report.AbstractFileReporter.testSetStarting(AbstractFileReporter.java:59)
    at org.apache.maven.surefire.report.ReporterManager.testSetStarting(ReporterManager.java:219)
    at org.apache.maven.surefire.suite.AbstractDirectoryTestSuite.executeTestSet(AbstractDirectoryTestSuite.java:138)
    at org.apache.maven.surefire.suite.AbstractDirectoryTestSuite.execute(AbstractDirectoryTestSuite.java:127)
    at org.apache.maven.surefire.Surefire.run(Surefire.java:177)
    at sun.reflect.NativeMethodAccessorImpl.invoke0(Native Method)
    at sun.reflect.NativeMethodAccessorImpl.invoke(NativeMethodAccessorImpl.java:39)
    at sun.reflect.DelegatingMethodAccessorImpl.invoke(DelegatingMethodAccessorImpl.java:25)
    at java.lang.reflect.Method.invoke(Method.java:597)
    at org.apache.maven.surefire.booter.SurefireBooter.runSuitesInProcess(SurefireBooter.java:338)
    at org.apache.maven.surefire.booter.SurefireBooter.main(SurefireBooter.java:997)
[INFO] ------------------------------------------------------------------------
[ERROR] BUILD FAILURE
[INFO] ------------------------------------------------------------------------
[INFO] There are test failures.

当我尝试使用 JUnit 运行程序从 NetBeans IDE 运行相同的测试时,出现相同的异常:

Exception in thread "main" java.lang.NullPointerException
        at java.io.Writer.write(Writer.java:140)
        at org.apache.tools.ant.util.DOMElementWriter.write(DOMElementWriter.java:212)
        at org.apache.tools.ant.taskdefs.optional.junit.XMLJUnitResultFormatter.endTestSuite(XMLJUnitResultFormatter.java:171)
        at org.apache.tools.ant.taskdefs.optional.junit.JUnitTestRunner.fireEndTestSuite(JUnitTestRunner.java:714)
        at org.apache.tools.ant.taskdefs.optional.junit.JUnitTestRunner.run(JUnitTestRunner.java:547)
        at org.apache.tools.ant.taskdefs.optional.junit.JUnitTestRunner.launch(JUnitTestRunner.java:1031)
        at org.apache.tools.ant.taskdefs.optional.junit.JUnitTestRunner.main(JUnitTestRunner.java:888)
Test football.dao.jpa.SimpleJPATest FAILED (crashed)

java.io.Writer 类的 write 方法只有一个 String 参数。这意味着运行者必须传递 null 作为参数。但这是怎么发生的呢?

public void write(String str) throws IOException {
    write(str, 0, str.length());
}

最佳答案

您实际看到的是 line.separator 系统的属性为 null。我无法根据我所看到的解释原因,但如果你可以测试它,请尝试这样做:

java.security.AccessController.doPrivileged(
               new sun.security.action.GetPropertyAction("line.separator"));

关于java - JUnit 运行程序从 java.io.Writer 获取 NullPointerException,我们在Stack Overflow上找到一个类似的问题: https://stackoverflow.com/questions/4227202/

相关文章:

java - 停止 JUnit 中的参数化测试套件

maven - 在surefire中检索成功测试的标准输出?

java - 如何切换到窗口身份验证弹出窗口并输入凭据?

java - 如何使用 Google Fitness API 获取特定时间的步数?

java - 将内部类对象作为函数参数传递

java - 如何使用 Netbeans 7.2 和 Maven 设置系统属性?

java - 对于 double 值,assertEquals 的 delta 或 epsilon 参数的含义

java - TypeNotPresentExceptionProxy

maven - 从 Maven 中排除 TestNG 组

java - 为什么java库的编码如此不可读?