gradle - 评估项目 ':app' 时出现问题。 > 路径不能为空或空字符串。路径 ='null'

原文 标签 gradle flutter keystore android-keystore

我在尝试运行 flutter 时遇到错误。

 D:\fluttapp\testbuild>flutter run
Launching lib/main.dart on Google Pixel 2 XL in debug mode...
Initializing gradle...                                       2.1s
Resolving dependencies...
* Error running Gradle:
ProcessException: Process "D:\fluttapp\testbuild\android\gradlew.bat" exited abnormally:

FAILURE: Build failed with an exception.

* Where:
Build file 'D:\fluttapp\testbuild\android\app\build.gradle' line: 57

* What went wrong:
A problem occurred evaluating project ':app'.
> path may not be null or empty string. path='null'

* Try:
Run with --stacktrace option to get the stack trace. Run with --info or --debug option to
get more log output. Run with --scan to get full insights.

* Get more help at https://help.gradle.org

BUILD FAILED in 6s
  Command: D:\fluttapp\testbuild\android\gradlew.bat app:properties


Please review your Gradle project setup in the android/ folder.

D:\fluttapp\testbuild>flutter doctor -v
[√] Flutter (Channel beta, v1.1.8, on Microsoft Windows [Version 10.0.17134.556], locale
    en-IN)
    • Flutter version 1.1.8 at D:\flutter
    • Framework revision 985ccb6d14 (3 weeks ago), 2019-01-08 13:45:55 -0800
    • Engine revision 7112b72cc2
    • Dart version 2.1.1 (build 2.1.1-dev.0.1 ec86471ccc)

[√] Android toolchain - develop for Android devices (Android SDK version 28.0.3)
    • Android SDK at D:\Users\Bhanu\AppData\Local
    • Android NDK location not configured (optional; useful for native profiling support)
    • Platform android-28, build-tools 28.0.3
    • ANDROID_HOME = D:\Users\Bhanu\AppData\Local
    • Java binary at: D:\Program Files\Android\Android Studio\jre\bin\java
    • Java version OpenJDK Runtime Environment (build 1.8.0_152-release-1024-b02)
    • All Android licenses accepted.

[√] Android Studio (version 3.1)
    • Android Studio at D:\Program Files\Android\Android Studio
    • Flutter plugin version 29.0.1
    • Dart plugin version 173.4700
    • Java version OpenJDK Runtime Environment (build 1.8.0_152-release-1024-b02)

[√] Connected device (1 available)
    • Google Pixel 2 XL • 192.168.50.101:5555 • android-x86 • Android 9 (API 28)

• No issues found!

我在这里添加了 repo 。我已经采取了示例代码来制作发布应用程序版本,但无法生成它们。创建 key 存储并添加到代码存储库

https://github.com/bhanu888/buildapk

最佳答案

对我来说,这是一个路径问题。

我正在关注 flutter 指南 https://flutter.io/docs/deployment/android

Create a file named <app dir>/android/key.properties that contains a reference to your keystore:

出于某种原因,我(错误地)将我的“key.properties”放在了 app_dir/android/应用程序文件夹,这给了我错误。
* What went wrong:
A problem occurred evaluating project ':app'.
> path may not be null or empty string. path='null'

因此,请检查您的路径以及文件所在的位置:)

奖金信息:
对 med 有帮助的是检查具有不同设置的“gradle.build”文件,并且始终是 storeFile 文件(keystoreProperties['storeFile'])给我带来了问题。
尝试将其注释掉,或将其更改为:
storeFile file("key.jks")  

如果这有效,您就知道“key.jks”文件的路径正确。然后尝试引入poperties文件(keystoreProperties)
喜欢
storeFile file(keystoreProperties['storeFile']) 

这起初不起作用,但现在起作用了:)

因此,再次检查您的“key.jks”和“key.properties”文件是否位于“正确”的位置,以及您如何指向它们。

关于gradle - 评估项目 ':app' 时出现问题。 > 路径不能为空或空字符串。路径 ='null',我们在Stack Overflow上找到一个类似的问题: https://stackoverflow.com/questions/54457245/

相关文章:

gradle - Gradle的Groovy语法:项目

java - Java/Gradle-从.class文件构建.jar文件

flutter - 如何使用 Flutter 将 PDF 文件转换为图像?

api - 取回不记名 token postman flutter 腾

java - 在同一个 JVM 上设置多个信任库

Java Keystore.getKey() 缓慢而 keystore 大小增加

java - 忽略/关闭 Jmeter/Java 中的证书验证

java - 安卓工作室 : NoClassDefFoundError

java - Android Gradle ResolutionStrategy force 仍然会下载以前版本的 lib

html - 如何防止flutter web htmlelementview捕获其上方对象的触摸?